{"text_format":"1","workbook":"xlsx","n_sheets":9,"sheets":["SOLICITAÇÃO","MEMORIAL DESCRITIVO","REPASSE ","Cor - Versões - Cód Barr","Frases-prazos-revisões","Certificados Gerais","Anexo Carrinhos","Dados Solicitação","Dados"],"not_rendered":{"charts":0,"images":11,"macros":1,"external_links":1,"defined_names":65,"comments":0,"pivot_tables":0},"unopened":[],"bounds":{"document_bytes":16777216,"sheet_cells":100000,"rows_first":2000,"rows_last":500,"rows_between":2000,"halvings":0,"cell_chars":16384,"cell_head_chars":4096},"cells_cut":0,"cells_raw":0,"read":"whole","date_system":"1900"}

{"sheet":"SOLICITAÇÃO","index":0,"n_rows":53,"n_cols":4,"rows_kept":53,"cut":false,"hidden":false,"merged":[[10,2,10,4],[58,3,58,4],[30,2,30,4],[31,2,31,4],[32,2,32,4],[50,1,50,4],[52,3,52,4],[53,3,53,4],[48,2,48,4],[33,2,33,4],[20,2,20,4],[18,2,18,4],[24,2,24,4],[25,2,25,4],[26,2,26,4],[46,2,46,4],[1,1,1,4],[6,1,6,4],[22,1,22,4],[41,1,41,4],[8,2,8,4],[17,2,17,4],[16,2,16,4],[15,2,15,4],[14,2,14,4],[13,2,13,4],[12,2,12,4],[11,2,11,4],[9,2,9,4],[19,2,19,4],[34,2,34,4],[35,2,35,4],[45,2,45,4],[44,3,44,4],[57,3,57,4],[54,3,54,4],[55,3,55,4],[56,3,56,4],[27,2,27,4],[28,2,28,4],[29,2,29,4],[39,2,39,4],[38,3,38,4],[37,3,37,4],[36,3,36,4]]}
[]
[null,"                                \n                                 ANÁLISE DE VIABILIDADE - CARRINHO\n                 \n                               "]
[]
[null,"SOLICITAÇÃO:","-"]
[null,"MODELO DE CERTIFICAÇÃO:","-"]
[]
[null,"DADOS DA EMPRESA SOLICITANTE"]
[]
[null,"RAZÃO SOCIAL:","-"]
[null,"NOME FANTASIA:","-"]
[null,"CNPJ:","-"]
[null,"ENDEREÇO:","-"]
[null,"BAIRRO:","-"]
[null,"CEP:","-"]
[null,"CIDADE:","-"]
[null,"ESTADO:","-"]
[null,"E-MAIL:","-"]
[null,"NOME DO CONTATO:","-"]
[null,"TELEFONE: (   )","-"]
[null,"DATA DA SOLICITAÇÃO:","-"]
[null,null,"______________________________________________________________________\nAssinatura (obrigatório)"]
[]
[null,"DADOS DA FÁBRICA"]
[]
[null,"RAZÃO SOCIAL:","-"]
[null,"NOME FANTASIA:","-"]
[null,"CNPJ:","-"]
[null,"ENDEREÇO:","-"]
[null,"BAIRRO:","-"]
[null,"CEP:","-"]
[null,"CIDADE:","-"]
[null,"ESTADO:","-"]
[null,"PAÍS:","-"]
[null,"E-MAIL - FÁBRICA:","-"]
[null,"NOME DO CONTATO FÁBRICA:","-"]
[null,"TELEFONE (DDD) XXXXX-XXXX:","-"]
[null,"PROCEDÊNCIA: ","-"]
[null,{"$f":"IF(C37=\"IMPORTADO\",\"PAÍS DE ORIGEM:\",\"\")","v":""},"-"]
[null,"POSSUI CERTIFICAÇÃO ISO 9001? (vigente)","-",{"$f":"IF(C39=\"SIM\",\"Enviar certificado com validade vigente via e-mail\",\"\")","v":""}]
[null,{"$f":"IF(C39=\"sim\",\"DESCREVA O ESCOPO DE CERTIFICAÇÃO\",\"\")","v":""},"-"]
[]
[null,"IDENTIFICAÇÃO DOS PRODUTOS"]
[]
[null,"PRODUTO COM MÚLTIPLAS CERTIFICAÇÕES (PRODUTO HÍBRIDO)?","-",{"$f":"IF(C44=\"SIM\",\"QUAL(IS)\",\"\")","v":""}]
[null,"POSSUI LICENÇA DE TERCEIROS?\n(USO DE MARCA): ","-",{"$f":"IF(C45=\"SIM\",\"Favor preencher as duas linhas abaixo\",\"\")","v":""}]
[null,{"$f":"IF(C45=\"SIM\",\"PRODUTOS LICENCIADOS:\",\"\")","v":""},"-"]
[null,{"$f":"IF(C45=\"SIM\",\"N° DA LICENÇA P/ USO DE MARCAS:\",\"\")","v":""},"-"]
[null,"EXISTE PROCESSO TERCEIRIZADO:","-"]
[null,{"$f":"IF(C48=\"SIM\",\"QUAL?\",\"\")","v":""},"-"]
[]
[null,"RELAÇÃO DE COMPONENTES\n(De acordo com o requisito 6.2.1.2 - e) da Portaria Inmetro n° 200/2021)\nTraduzidos para o Português, quando em idioma distinto do Inglês ou Espanhol;\n\nComponentes podem ser:\nRodas, alças, dispositivos de ajuste, elementos de fixação, mecanismo de travamento, em alguns casos, um dispositivo adicional, tal como um berço portátil, um sistema de transporte de bebês, uma cadeira adicional e todos os demais componentes utilizados para a construção do modelo que impactem a conformidade do produto, que sejam fornecidos por empresa terceira ou produzidos pela própria empresa fabricante do produto final."]
[]
[null,"COMPONENTE","MATERIAL UTILIZADO","FORNECEDOR(ES)"]

{"sheet":"MEMORIAL DESCRITIVO","index":1,"n_rows":123,"n_cols":17,"rows_kept":123,"cut":false,"hidden":false,"merged":[[80,16,85,17],[80,7,85,8],[80,10,85,11],[80,9,85,9],[80,12,85,12],[80,13,85,14],[62,1,62,2],[60,1,60,2],[66,13,75,14],[28,13,29,13],[31,1,32,1],[31,4,32,4],[31,7,32,7],[31,10,32,10],[31,13,32,13],[25,1,26,1],[22,1,23,1],[80,4,81,5],[80,1,81,2],[34,1,35,1],[34,4,35,4],[34,7,35,7],[34,10,35,10],[34,13,35,13],[37,1,38,1],[37,4,38,4],[37,7,38,7],[37,10,38,10],[37,13,38,13],[44,7,48,14],[55,7,55,8],[55,10,55,11],[25,13,26,13],[16,4,17,4],[19,4,20,4],[22,4,23,4],[25,4,26,4],[13,7,14,7],[16,7,17,7],[19,7,20,7],[22,7,23,7],[25,7,26,7],[13,13,14,13],[16,13,17,13],[19,13,20,13],[22,13,23,13],[87,4,88,5],[6,4,6,8],[44,1,48,1],[3,4,3,8],[4,4,4,8],[5,4,5,8],[4,1,4,2],[3,1,3,2],[13,10,14,10],[16,10,17,10],[19,10,20,10],[22,10,23,10],[25,10,26,10],[19,1,20,1],[16,1,17,1],[13,1,14,1],[13,4,14,4],[28,1,29,1],[28,4,29,4],[28,7,29,7],[28,10,29,10],[87,1,88,2],[84,4,85,5],[84,1,85,2],[109,5,118,8],[109,2,118,2],[96,1,105,1],[96,7,105,7],[96,2,105,5],[96,8,105,11],[82,4,83,5],[82,1,83,2],[59,1,59,2],[58,1,58,2],[66,1,75,1],[74,3,74,4],[64,1,64,2],[72,9,72,10],[73,9,73,10],[74,9,74,10],[67,9,67,10],[91,1,92,2],[91,4,92,5],[89,4,90,5],[89,1,90,2],[66,9,66,10],[87,7,92,8],[87,9,92,9],[87,10,92,11],[87,12,92,12],[87,13,92,14],[109,11,118,14],[96,13,105,14],[66,7,75,7],[75,3,75,4],[71,3,71,4],[72,3,72,4],[73,3,73,4],[79,1,79,14],[50,12,53,14],[50,9,53,11],[50,7,53,8],[68,9,68,10],[69,9,69,10],[70,9,70,10],[71,9,71,10],[66,3,66,4],[67,3,67,4],[68,3,68,4],[69,3,69,4],[70,3,70,4],[56,10,62,14],[63,10,63,14],[1,1,1,14],[11,1,11,14],[42,1,42,14],[120,1,120,14],[122,1,131,1],[122,2,131,2],[122,4,131,4],[122,5,131,8],[122,10,131,10],[57,1,57,2],[56,1,56,2],[55,1,55,2],[50,1,53,2],[6,1,6,2],[5,1,5,2],[107,1,107,14],[94,1,94,14],[77,1,77,14],[109,1,118,1],[109,4,118,4],[109,10,118,10],[63,1,63,2],[75,9,75,10],[122,11,131,14],[8,1,8,2],[8,4,8,5],[8,7,8,8],[8,10,8,11],[8,13,8,14],[9,1,9,2],[9,4,9,5],[9,7,9,8],[9,10,9,11],[9,13,9,14]]}
[]
[null,"IDENTIFICAÇÃO DO MODELO OBJETO DA CERTIFICAÇÃO"]
[]
[null,"MODELO:",null,null,"-"]
[null,"MARCA:",null,null,"-"]
[null,"NOME COMERCIAL:",null,null,"-"]
[null,"CÓDIGO DO FABRICANTE:",null,null,"-"]
[]
[null,{"$f":"IF(SOLICITAÇÃO!C5=\"MODELO 1b - LOTE\",\"IDENTIFICAÇÃO LOTE\",\"\")","v":""},null,null,{"$f":"IF(SOLICITAÇÃO!C5=\"MODELO 1b - LOTE\",\"QUANTIDADE DO LOTE\",\"\")","v":""},null,null,{"$f":"IF(SOLICITAÇÃO!C5=\"MODELO 1b - LOTE\",\"N° DO LOTE DE FABRICAÇÃO\",\"\")","v":""},null,null,{"$f":"IF(SOLICITAÇÃO!C5=\"MODELO 1b - LOTE\",\"LI/LPCO/DI/DUIMP\",\"\")","v":""},null,null,{"$f":"IF(SOLICITAÇÃO!C5=\"MODELO 1b - LOTE\",\"N° DO EDITAL\",\"\")","v":""}]
[]
[]
[null,"VERSÃO/COR/ESTAMPA - CÓDIGO DE BARRAS"]
[]
[null,1,{"$f":"IFERROR(VLOOKUP(B14,'Cor - Versões - Cód Barr'!$B$3:$D$30,2,0),\" \")","v":"-"},null,10,{"$f":"IFERROR(VLOOKUP(E14,'Cor - Versões - Cód Barr'!$B$3:$D$47,2,0),\" \")","v":"-"},null,19,{"$f":"IFERROR(VLOOKUP(H14,'Cor - Versões - Cód Barr'!$B$3:$D$47,2,0),\" \")","v":"-"},null,28,{"$f":"IFERROR(VLOOKUP(K14,'Cor - Versões - Cód Barr'!$B$3:$D$47,2,0),\" \")","v":"-"},null,37,{"$f":"IFERROR(VLOOKUP(N14,'Cor - Versões - Cód Barr'!$B$3:$D$47,2,0),\" \")","v":"-"}]
[null,null,{"$f":"IFERROR(VLOOKUP(B14,'Cor - Versões - Cód Barr'!$B$3:$D$30,3,0),\" \")","v":"-"},null,null,{"$f":"IFERROR(VLOOKUP(E14,'Cor - Versões - Cód Barr'!$B$3:$D$47,3,0),\" \")","v":"-"},null,null,{"$f":"IFERROR(VLOOKUP(H14,'Cor - Versões - Cód Barr'!$B$3:$D$47,3,0),\" \")","v":"-"},null,null,{"$f":"IFERROR(VLOOKUP(K14,'Cor - Versões - Cód Barr'!$B$3:$D$47,3,0),\" \")","v":"-"},null,null,{"$f":"IFERROR(VLOOKUP(N14,'Cor - Versões - Cód Barr'!$B$3:$D$47,3,0),\" \")","v":"-"}]
[]
[null,2,{"$f":"IFERROR(VLOOKUP(B17,'Cor - Versões - Cód Barr'!$B$3:$D$30,2,0),\" \")","v":"-"},null,11,{"$f":"IFERROR(VLOOKUP(E17,'Cor - Versões - Cód Barr'!$B$3:$D$47,2,0),\" \")","v":"-"},null,20,{"$f":"IFERROR(VLOOKUP(H17,'Cor - Versões - Cód Barr'!$B$3:$D$47,2,0),\" \")","v":"-"},null,29,{"$f":"IFERROR(VLOOKUP(K17,'Cor - Versões - Cód Barr'!$B$3:$D$47,2,0),\" \")","v":"-"},null,38,{"$f":"IFERROR(VLOOKUP(N17,'Cor - Versões - Cód Barr'!$B$3:$D$47,2,0),\" \")","v":"-"}]
[null,null,{"$f":"IFERROR(VLOOKUP(B17,'Cor - Versões - Cód Barr'!$B$3:$D$30,3,0),\" \")","v":"-"},null,null,{"$f":"IFERROR(VLOOKUP(E17,'Cor - Versões - Cód Barr'!$B$3:$D$47,3,0),\" \")","v":"-"},null,null,{"$f":"IFERROR(VLOOKUP(H17,'Cor - Versões - Cód Barr'!$B$3:$D$47,3,0),\" \")","v":"-"},null,null,{"$f":"IFERROR(VLOOKUP(K17,'Cor - Versões - Cód Barr'!$B$3:$D$47,3,0),\" \")","v":"-"},null,null,{"$f":"IFERROR(VLOOKUP(N17,'Cor - Versões - Cód Barr'!$B$3:$D$47,3,0),\" \")","v":"-"}]
[]
[null,3,{"$f":"IFERROR(VLOOKUP(B20,'Cor - Versões - Cód Barr'!$B$3:$D$30,2,0),\" \")","v":"-"},null,12,{"$f":"IFERROR(VLOOKUP(E20,'Cor - Versões - Cód Barr'!$B$3:$D$47,2,0),\" \")","v":"-"},null,21,{"$f":"IFERROR(VLOOKUP(H20,'Cor - Versões - Cód Barr'!$B$3:$D$47,2,0),\" \")","v":"-"},null,30,{"$f":"IFERROR(VLOOKUP(K20,'Cor - Versões - Cód Barr'!$B$3:$D$47,2,0),\" \")","v":"-"},null,39,{"$f":"IFERROR(VLOOKUP(N20,'Cor - Versões - Cód Barr'!$B$3:$D$47,2,0),\" \")","v":"-"}]
[null,null,{"$f":"IFERROR(VLOOKUP(B20,'Cor - Versões - Cód Barr'!$B$3:$D$30,3,0),\" \")","v":"-"},null,null,{"$f":"IFERROR(VLOOKUP(E20,'Cor - Versões - Cód Barr'!$B$3:$D$47,3,0),\" \")","v":"-"},null,null,{"$f":"IFERROR(VLOOKUP(H20,'Cor - Versões - Cód Barr'!$B$3:$D$47,3,0),\" \")","v":"-"},null,null,{"$f":"IFERROR(VLOOKUP(K20,'Cor - Versões - Cód Barr'!$B$3:$D$47,3,0),\" \")","v":"-"},null,null,{"$f":"IFERROR(VLOOKUP(N20,'Cor - Versões - Cód Barr'!$B$3:$D$47,3,0),\" \")","v":"-"}]
[]
[null,4,{"$f":"IFERROR(VLOOKUP(B23,'Cor - Versões - Cód Barr'!$B$3:$D$30,2,0),\" \")","v":"-"},null,13,{"$f":"IFERROR(VLOOKUP(E23,'Cor - Versões - Cód Barr'!$B$3:$D$47,2,0),\" \")","v":"-"},null,22,{"$f":"IFERROR(VLOOKUP(H23,'Cor - Versões - Cód Barr'!$B$3:$D$47,2,0),\" \")","v":"-"},null,31,{"$f":"IFERROR(VLOOKUP(K23,'Cor - Versões - Cód Barr'!$B$3:$D$47,2,0),\" \")","v":"-"},null,40,{"$f":"IFERROR(VLOOKUP(N23,'Cor - Versões - Cód Barr'!$B$3:$D$47,2,0),\" \")","v":"-"}]
[null,null,{"$f":"IFERROR(VLOOKUP(B23,'Cor - Versões - Cód Barr'!$B$3:$D$30,3,0),\" \")","v":"-"},null,null,{"$f":"IFERROR(VLOOKUP(E23,'Cor - Versões - Cód Barr'!$B$3:$D$47,3,0),\" \")","v":"-"},null,null,{"$f":"IFERROR(VLOOKUP(H23,'Cor - Versões - Cód Barr'!$B$3:$D$47,3,0),\" \")","v":"-"},null,null,{"$f":"IFERROR(VLOOKUP(K23,'Cor - Versões - Cód Barr'!$B$3:$D$47,3,0),\" \")","v":"-"},null,null,{"$f":"IFERROR(VLOOKUP(N23,'Cor - Versões - Cód Barr'!$B$3:$D$47,3,0),\" \")","v":"-"}]
[]
[null,5,{"$f":"IFERROR(VLOOKUP(B26,'Cor - Versões - Cód Barr'!$B$3:$D$30,2,0),\" \")","v":"-"},null,14,{"$f":"IFERROR(VLOOKUP(E26,'Cor - Versões - Cód Barr'!$B$3:$D$47,2,0),\" \")","v":"-"},null,23,{"$f":"IFERROR(VLOOKUP(H26,'Cor - Versões - Cód Barr'!$B$3:$D$47,2,0),\" \")","v":"-"},null,32,{"$f":"IFERROR(VLOOKUP(K26,'Cor - Versões - Cód Barr'!$B$3:$D$47,2,0),\" \")","v":"-"},null,41,{"$f":"IFERROR(VLOOKUP(N26,'Cor - Versões - Cód Barr'!$B$3:$D$47,2,0),\" \")","v":"-"}]
[null,null,{"$f":"IFERROR(VLOOKUP(B26,'Cor - Versões - Cód Barr'!$B$3:$D$30,3,0),\" \")","v":"-"},null,null,{"$f":"IFERROR(VLOOKUP(E26,'Cor - Versões - Cód Barr'!$B$3:$D$47,3,0),\" \")","v":"-"},null,null,{"$f":"IFERROR(VLOOKUP(H26,'Cor - Versões - Cód Barr'!$B$3:$D$47,3,0),\" \")","v":"-"},null,null,{"$f":"IFERROR(VLOOKUP(K26,'Cor - Versões - Cód Barr'!$B$3:$D$47,3,0),\" \")","v":"-"},null,null,{"$f":"IFERROR(VLOOKUP(N26,'Cor - Versões - Cód Barr'!$B$3:$D$47,3,0),\" \")","v":"-"}]
[]
[null,6,{"$f":"IFERROR(VLOOKUP(B29,'Cor - Versões - Cód Barr'!$B$3:$D$30,2,0),\" \")","v":"-"},null,15,{"$f":"IFERROR(VLOOKUP(E29,'Cor - Versões - Cód Barr'!$B$3:$D$47,2,0),\" \")","v":"-"},null,24,{"$f":"IFERROR(VLOOKUP(H29,'Cor - Versões - Cód Barr'!$B$3:$D$47,2,0),\" \")","v":"-"},null,33,{"$f":"IFERROR(VLOOKUP(K29,'Cor - Versões - Cód Barr'!$B$3:$D$47,2,0),\" \")","v":"-"},null,42,{"$f":"IFERROR(VLOOKUP(N29,'Cor - Versões - Cód Barr'!$B$3:$D$47,2,0),\" \")","v":"-"}]
[null,null,{"$f":"IFERROR(VLOOKUP(B29,'Cor - Versões - Cód Barr'!$B$3:$D$30,3,0),\" \")","v":"-"},null,null,{"$f":"IFERROR(VLOOKUP(E29,'Cor - Versões - Cód Barr'!$B$3:$D$47,3,0),\" \")","v":"-"},null,null,{"$f":"IFERROR(VLOOKUP(H29,'Cor - Versões - Cód Barr'!$B$3:$D$47,3,0),\" \")","v":"-"},null,null,{"$f":"IFERROR(VLOOKUP(K29,'Cor - Versões - Cód Barr'!$B$3:$D$47,3,0),\" \")","v":"-"},null,null,{"$f":"IFERROR(VLOOKUP(N29,'Cor - Versões - Cód Barr'!$B$3:$D$47,3,0),\" \")","v":"-"}]
[]
[null,7,{"$f":"IFERROR(VLOOKUP(B32,'Cor - Versões - Cód Barr'!$B$3:$D$30,2,0),\" \")","v":"-"},null,16,{"$f":"IFERROR(VLOOKUP(E32,'Cor - Versões - Cód Barr'!$B$3:$D$47,2,0),\" \")","v":"-"},null,25,{"$f":"IFERROR(VLOOKUP(H32,'Cor - Versões - Cód Barr'!$B$3:$D$47,2,0),\" \")","v":"-"},null,34,{"$f":"IFERROR(VLOOKUP(K32,'Cor - Versões - Cód Barr'!$B$3:$D$47,2,0),\" \")","v":"-"},null,43,{"$f":"IFERROR(VLOOKUP(N32,'Cor - Versões - Cód Barr'!$B$3:$D$47,2,0),\" \")","v":"-"}]
[null,null,{"$f":"IFERROR(VLOOKUP(B32,'Cor - Versões - Cód Barr'!$B$3:$D$30,3,0),\" \")","v":"-"},null,null,{"$f":"IFERROR(VLOOKUP(E32,'Cor - Versões - Cód Barr'!$B$3:$D$47,3,0),\" \")","v":"-"},null,null,{"$f":"IFERROR(VLOOKUP(H32,'Cor - Versões - Cód Barr'!$B$3:$D$47,3,0),\" \")","v":"-"},null,null,{"$f":"IFERROR(VLOOKUP(K32,'Cor - Versões - Cód Barr'!$B$3:$D$47,3,0),\" \")","v":"-"},null,null,{"$f":"IFERROR(VLOOKUP(N32,'Cor - Versões - Cód Barr'!$B$3:$D$47,3,0),\" \")","v":"-"}]
[]
[null,8,{"$f":"IFERROR(VLOOKUP(B35,'Cor - Versões - Cód Barr'!$B$3:$D$30,2,0),\" \")","v":"-"},null,17,{"$f":"IFERROR(VLOOKUP(E35,'Cor - Versões - Cód Barr'!$B$3:$D$47,2,0),\" \")","v":"-"},null,26,{"$f":"IFERROR(VLOOKUP(H35,'Cor - Versões - Cód Barr'!$B$3:$D$47,2,0),\" \")","v":"-"},null,35,{"$f":"IFERROR(VLOOKUP(K35,'Cor - Versões - Cód Barr'!$B$3:$D$47,2,0),\" \")","v":"-"},null,44,{"$f":"IFERROR(VLOOKUP(N35,'Cor - Versões - Cód Barr'!$B$3:$D$47,2,0),\" \")","v":"-"}]
[null,null,{"$f":"IFERROR(VLOOKUP(B35,'Cor - Versões - Cód Barr'!$B$3:$D$30,3,0),\" \")","v":"-"},null,null,{"$f":"IFERROR(VLOOKUP(E35,'Cor - Versões - Cód Barr'!$B$3:$D$47,3,0),\" \")","v":"-"},null,null,{"$f":"IFERROR(VLOOKUP(H35,'Cor - Versões - Cód Barr'!$B$3:$D$47,3,0),\" \")","v":"-"},null,null,{"$f":"IFERROR(VLOOKUP(K35,'Cor - Versões - Cód Barr'!$B$3:$D$47,3,0),\" \")","v":"-"},null,null,{"$f":"IFERROR(VLOOKUP(N35,'Cor - Versões - Cód Barr'!$B$3:$D$47,3,0),\" \")","v":"-"}]
[]
[null,9,{"$f":"IFERROR(VLOOKUP(B38,'Cor - Versões - Cód Barr'!$B$3:$D$30,2,0),\" \")","v":"-"},null,18,{"$f":"IFERROR(VLOOKUP(E38,'Cor - Versões - Cód Barr'!$B$3:$D$47,2,0),\" \")","v":"-"},null,27,{"$f":"IFERROR(VLOOKUP(H38,'Cor - Versões - Cód Barr'!$B$3:$D$47,2,0),\" \")","v":"-"},null,36,{"$f":"IFERROR(VLOOKUP(K38,'Cor - Versões - Cód Barr'!$B$3:$D$47,2,0),\" \")","v":"-"},null,45,{"$f":"IFERROR(VLOOKUP(N38,'Cor - Versões - Cód Barr'!$B$3:$D$47,2,0),\" \")","v":"-"}]
[null,null,{"$f":"IFERROR(VLOOKUP(B38,'Cor - Versões - Cód Barr'!$B$3:$D$30,3,0),\" \")","v":"-"},null,null,{"$f":"IFERROR(VLOOKUP(E38,'Cor - Versões - Cód Barr'!$B$3:$D$47,3,0),\" \")","v":"-"},null,null,{"$f":"IFERROR(VLOOKUP(H38,'Cor - Versões - Cód Barr'!$B$3:$D$47,3,0),\" \")","v":"-"},null,null,{"$f":"IFERROR(VLOOKUP(K38,'Cor - Versões - Cód Barr'!$B$3:$D$47,3,0),\" \")","v":"-"},null,null,{"$f":"IFERROR(VLOOKUP(N38,'Cor - Versões - Cód Barr'!$B$3:$D$47,3,0),\" \")","v":"-"}]
[]
[]
[]
[null,"CARACTERÍSTICAS CONSTRUTIVAS - COMPOSIÇÃO"]
[]
[null,"MATERIAIS","Chassi: ",null,null,"-",null,"Nota: \n- Favor preencher com N/A quando não aplicável.\n- Informar material correspondente de cada item (se aplicável)"]
[null,null,"Cesto para crianças (Moisés):",null,null,"-"]
[null,null,"Unidade de assento:",null,null,"-"]
[null,null,"Sistema de retenção:",null,null,"-"]
[null,null,"Dispositivos adicionais de retenção:",null,null,"-"]
[]
[null,"Comprimento interno máximo (mm): ",null,null,null,"Unidade de assento",null,"Informar comprimento(mm) da unidade de assento e também do moisés se aplicável "]
[null,null,null,null,null,"-"]
[null,null,null,null,null,"Cesto para Bebês (Moisés)\nse aplicável"]
[null,null,null,null,null,"-"]
[]
[null,"Tipo de Carrinho",null,null,null,"-",null,"Possui mais de uma funcionalidade?",null,null,"-"]
[null,"Dimensões:",null,null,null,"-",null,null,null,null,"3.5 Carrinho tipo berço \nCarrinho para transporte de bebês, ainda incapazes de sentar-se sem auxílio, geralmente em uma posição horizontal, composto de um chassi e um ou mais cestos para bebês.\n3.6 Carrinho de passeio\nCarrinho para o transporte de crianças, geralmente em uma posição sentada, semi-reclinada ou reclinada, composto de um chassi e uma ou mais unidades de assento\n3.7 Carrinho de bebê conversível ou múltiplo\nCarrinho que combina a possibilidade de dois usos, onde o cesto para bebês transforma-se em uma unidade de assento e vice-versa\n3.8 Carrinho combinado\nCarrinho que combina a possibilidade de vários usos, pelo acoplamento de cesto(s) para bebês, unidade(s) de assento, dispositivo(s) de retenção para crianças utilizado(s) em automóvel ou item similar ao chassi"]
[null,"Idade mínima (meses ou anos):",null,null,null,"-",null,{"$f":"IF(F58=\"Outro:\",\"Qual:\",\"\")","v":""}]
[null,"Idade máxima (meses ou anos):",null,null,null,"-",null,{"$f":"IF(F59=\"Outro:\",\"Qual:\",\"\")","v":""}]
[null,"Tipo de mecanismo de travamento:",null,null,null,"-",null,""]
[null,"Sistema de montagem/ferragem:",null,null,null,"-",null,""]
[null,null,null,null,null,null,null,""]
[null,"Tipo de unidade de assento:",null,null,null,"-"]
[null,"Tipo de fixadores:",null,null,null,"-",null,"","Observação",null,"Dispositivo para fixação de DRC no carrinho"]
[null,"Número máximo de crianças que podem ser transportadas:",null,null,null,"-",null,""]
[]
[null,"ACESSÓRIOS CONTIDOS NA EMBALAGEM: ","-",{"$f":"IF(VLOOKUP(C67,Dados!$L$2:$M$13,2,0)=2,\"Qual:\",\"-\")","v":"-"},null,null,null,"ACESSÓRIOS VENDIDOS SEPARADAMENTE:","-",{"$f":"IF(VLOOKUP(I67,Dados!L15:M26,2,0)=2,\"Qual:\",\"-\")","v":"-"},null,null,null,"Quando selecionado os acessórios:\n\n\n- Dispositivo de retenção para crianças para automóvel\n- Cesto para crianças (MOISÉS)\n\nÉ obrigatório o preenchimento do MODELO na célula ao lado   "]
[null,null,"-",{"$f":"IF(VLOOKUP(C68,Dados!$L$2:$M$13,2,0)=2,\"Qual:\",\"-\")","v":"-"},null,null,null,null,"-",{"$f":"IF(VLOOKUP(I68,Dados!$L$2:$M$13,2,0)=2,\"Qual:\",\"-\")","v":"-"}]
[null,null,"-",{"$f":"IF(VLOOKUP(C69,Dados!$L$2:$M$13,2,0)=2,\"Qual:\",\"-\")","v":"-"},null,null,null,null,"-",{"$f":"IF(VLOOKUP(I69,Dados!$L$2:$M$13,2,0)=2,\"Qual:\",\"-\")","v":"-"}]
[null,null,"-",{"$f":"IF(VLOOKUP(C70,Dados!$L$2:$M$13,2,0)=2,\"Qual:\",\"-\")","v":"-"},null,null,null,null,"-",{"$f":"IF(VLOOKUP(I70,Dados!$L$2:$M$13,2,0)=2,\"Qual:\",\"-\")","v":"-"}]
[null,null,"-",{"$f":"IF(VLOOKUP(C71,Dados!$L$2:$M$13,2,0)=2,\"Qual:\",\"-\")","v":"-"},null,null,null,null,"-",{"$f":"IF(VLOOKUP(I71,Dados!$L$2:$M$13,2,0)=2,\"Qual:\",\"-\")","v":"-"}]
[null,null,"-",{"$f":"IF(VLOOKUP(C72,Dados!$L$2:$M$13,2,0)=2,\"Qual:\",\"-\")","v":"-"},null,null,null,null,"-",{"$f":"IF(VLOOKUP(I72,Dados!$L$2:$M$13,2,0)=2,\"Qual:\",\"-\")","v":"-"}]
[null,null,"-",{"$f":"IF(VLOOKUP(C73,Dados!$L$2:$M$13,2,0)=2,\"Qual:\",\"-\")","v":"-"},null,null,null,null,"-",{"$f":"IF(VLOOKUP(I73,Dados!$L$2:$M$13,2,0)=2,\"Qual:\",\"-\")","v":"-"}]
[null,null,"-",{"$f":"IF(VLOOKUP(C74,Dados!$L$2:$M$13,2,0)=2,\"Qual:\",\"-\")","v":"-"},null,null,null,null,"-",{"$f":"IF(VLOOKUP(I74,Dados!$L$2:$M$13,2,0)=2,\"Qual:\",\"-\")","v":"-"}]
[null,null,"-",{"$f":"IF(VLOOKUP(C75,Dados!$L$2:$M$13,2,0)=2,\"Qual:\",\"-\")","v":"-"},null,null,null,null,"-",{"$f":"IF(VLOOKUP(I75,Dados!$L$2:$M$13,2,0)=2,\"Qual:\",\"-\")","v":"-"}]
[null,null,"-",{"$f":"IF(VLOOKUP(C76,Dados!$L$2:$M$13,2,0)=2,\"Qual:\",\"-\")","v":"-"},null,null,null,null,"-",{"$f":"IF(VLOOKUP(I76,Dados!$L$2:$M$13,2,0)=2,\"Qual:\",\"-\")","v":"-"}]
[]
[null,"POSICIONAMENTO DAS MARCAÇÕES OBRIGATÓRIAS:"]
[]
[null,"Nota: Informar onde está aposto as seguintes marcações obrigatórias no produto"]
[null,"1 - Nome ou marca comercial do fornecedor:",null,null,"-",null,null,1,null,null,2,null,null,3,null,null,"Informar a localização que está no carrinho as marcações obrigatórias"]
[]
[null,"2 - Número de referência ou número de série:",null,null,"-"]
[]
[null,"3 - Avisos de atenção:",null,null,"-"]
[]
[]
[null,"4 - O número e a data da Norma ABNT NBR 14389:",null,null,"-",null,null,4,null,null,5,null,null,6]
[]
[null,"5 - Idade mínima e peso de até 15 Kg a que se destina o produto",null,null,"-"]
[]
[null,"6 - Selo de Identificação da Conformidade:",null,null,"-"]
[]
[]
[null,"DESENHO DO PRODUTO"]
[]
[null,"EXEMPLO","Exemplo",null,null,null,null,"DESENHO DO PRODUTO (CLIENTE):","-",null,null,null,null,"Obrigatório anexar as imagens com resolução mínima \n800x600 dpi"]
[]
[]
[]
[]
[]
[]
[]
[]
[]
[]
[null,"DESENHO ESQUEMÁTICO"]
[]
[null,"EXEMPLO:",null,null,"DESENHO ESQUEMÁTICO - VISÃO FRONTAL (CLIENTE):","-",null,null,null,null,"DESENHO ESQUEMÁTICO - VISÃO LATERAL (CLIENTE):","-"]
[]
[]
[]
[]
[]
[]
[]
[]
[]
[]
[null,"FOTO DO PRODUTO"]
[]
[null,"EXEMPLO:",null,null,"FOTO DO PRODUTO - VISÃO FRONTAL (CLIENTE):","-",null,null,null,null,"FOTO DO PRODUTO - VISÃO LATERAL (CLIENTE):","-"]

{"sheet":"REPASSE ","index":2,"n_rows":29,"n_cols":3,"rows_kept":29,"cut":false,"hidden":true,"merged":[[8,2,8,4],[9,2,9,4],[10,2,10,4],[22,2,22,4],[1,1,1,4],[3,1,3,4],[5,2,5,4],[6,2,6,4],[7,2,7,4],[11,2,11,4],[12,2,12,4],[13,2,13,4],[14,2,14,4],[15,2,15,4],[28,1,32,1],[16,2,16,4],[18,2,18,4],[20,2,20,4],[28,2,32,4]]}
[]
[null,"REPASSE"]
[]
[null,"DADOS DO EMBALADOR - (Somente em caso de repasse)"]
[]
[null,"RAZÃO SOCIAL:","-"]
[null,"NOME FANTASIA:","-"]
[null,"CNPJ:","-"]
[null,"ENDEREÇO:","-"]
[null,"BAIRRO:","-"]
[null,"CEP:","-"]
[null,"CIDADE:","-"]
[null,"ESTADO:","-"]
[null,"E-MAIL:","-"]
[null,"NOME DO CONTATO:","-"]
[null,"TELEFONE: (   )","-"]
[null,"DATA DA SOLICITAÇÃO:","-"]
[]
[null,"N° AUTORIZAÇÃO PARTICULAR DE REPASSE:","-"]
[]
[null,"N° AUTORIZAÇÃO DE USO DA MARCA:","-"]
[]
[null,"N° DE LICENÇA DE IMPORTAÇÃO:","-"]
[]
[null,"PROCEDÊNCIA: ","-"]
[null,{"$f":"IF(C25=\"IMPORTADO\",\"PAÍS DE ORIGEM:\",\"\")","v":""},"-"]
[null,{"$f":"IF(C25=\"IMPORTADO\",\"N° DA LICENÇA DE IMPORTAÇÃO\",\"-\")","v":"-"},"-"]
[]
[null,null,"______________________________________________________________________\nAssinatura (obrigatório)\n"]

{"sheet":"Cor - Versões - Cód Barr","index":3,"n_rows":47,"n_cols":4,"rows_kept":47,"cut":false,"hidden":false,"merged":[]}
[]
[null,null,"COR/VERSÕES"," CÓDIGO DE BARRAS"]
[null,1,"-","-"]
[null,2,"-","-"]
[null,3,"-","-"]
[null,4,"-","-"]
[null,5,"-","-"]
[null,6,"-","-"]
[null,7,"-","-"]
[null,8,"-","-"]
[null,9,"-","-"]
[null,10,"-","-"]
[null,11,"-","-"]
[null,12,"-","-"]
[null,13,"-","-"]
[null,14,"-","-"]
[null,15,"-","-"]
[null,16,"-","-"]
[null,17,"-","-"]
[null,18,"-","-"]
[null,19,"-","-"]
[null,20,"-","-"]
[null,21,"-","-"]
[null,22,"-","-"]
[null,23,"-","-"]
[null,24,"-","-"]
[null,25,"-","-"]
[null,26,"-","-"]
[null,27,"-","-"]
[null,28,"-","-"]
[null,29,"-","-"]
[null,30,"-","-"]
[null,31,"-","-"]
[null,32,"-","-"]
[null,33,"-","-"]
[null,34,"-","-"]
[null,35,"-","-"]
[null,36,"-","-"]
[null,37,"-","-"]
[null,38,"-","-"]
[null,39,"-","-"]
[null,40,"-","-"]
[null,41,"-","-"]
[null,42,"-","-"]
[null,43,"-","-"]
[null,44,"-","-"]
[null,45,"-","-"]

{"sheet":"Frases-prazos-revisões","index":4,"n_rows":9,"n_cols":12,"rows_kept":9,"cut":false,"hidden":true,"merged":[[0,6,0,8]]}
[null,null,null,null,null,null,"CONTROLE DE FORMULÁRIO"]
[null,"MODELO DE CERTIFICAÇÃO","VALIDADE DO CERTIFICADO","VALIDADE DAS MANUTENÇÕES","FRASES PADRÕES PARA ESCOPO (OBSOLETAS)","FRASES PADRÕES PARA ESCOPO","FOR. Nº","REVISÃO","DATA","Atualizado por","Data","Justificativa"]
[null,"Selecionar opção"]
[null,"CARRINHOS - MODELO 5",{"$f":"3*12","v":36},null,"Em conformidade com requisitos da Portaria Inmetro nº 167, de 03 de abril de 2021 e à Norma ABNT NBR NM 14389:2010 e ABNT NBR NM 14400:2020, comprometendo-se à certificada a cumpri-las integralmente, pelo modelo 5 de certificação, e terá validade de 3 anos.","Portarias aplicáveis:\nPortaria Inmetro nº 167, de 13 de abril de 2021  e Portaria Inmetro nº 200, de 29 de abril de 2021.\n\nNormas aplicáveis: \nABNT NBR 14389:2010 - Segurança de carrinhos para crianças.\nABNT NBR 14400:2020 - Veículos rodoviários automotores — Dispositivos de retenção para crianças — Requisitos de segurança.\n\nModelo de certificação: 5.\nValidade do certificado: 3 anos.   ","FOR.10.14","Rev.01","2021-12-14","Amanda Siqueira ","2021-12-14","Foi atualizada a tabela com as especificações técnicas do Anexo inserindo as seguintes informações: sistema de montagem / ferragem; acessórios vendidos separadamente; acessórios contidos na embalagem e retirando a informação do freio conforme Portaria Inmetro nº  167. "]
[null,"CARRINHOS - MODELO 1b",{"$f":"10*12","v":120},null,"Em conformidade com requisitos da Portaria Inmetro nº 167, de 03 de abril de 2021 e à Norma ABNT NBR NM 14389:2010 e ABNT NBR NM 14400:2010, comprometendo-se à certificada a cumpri-las integralmente, pelo modelo 1b de certificação, e terá validade de 10 anos. ","Portarias aplicáveis:\nPortaria Inmetro nº 167, de 13 de abril de 2021  e Portaria Inmetro nº 200, de 29 de abril de 2021.\n\nNormas aplicáveis: \nABNT NBR 14389:2010 - Segurança de carrinhos para crianças.\nABNT NBR 14400:2020 - Veículos rodoviários automotores — Dispositivos de retenção para crianças — Requisitos de segurança\n\nModelo de certificação: 1b.\nValidade do certificado: 10 anos.","FOR.10.15","Rev.01","2021-12-14","Amanda Siqueira ","2021-12-14","Foi atualizada a tabela com as especificações técnicas do Anexo inserindo as seguintes informações: sistema de montagem / ferragem; acessórios vendidos separadamente; acessórios contidos na embalagem e retirando a informação do freio conforme Portaria Inmetro nº  167. "]
[null,"CARRINHOS - MODELO 5",{"$f":"3*12","v":36},null,"Em conformidade com requisitos da Portaria Inmetro nº 167, de 03 de abril de 2021 e à Norma ABNT NBR NM 14389:2010 e ABNT NBR NM 14400:2020, comprometendo-se à certificada a cumpri-las integralmente, pelo modelo 5 de certificação, e terá validade de 3 anos.","Portarias aplicáveis:\nPortaria Inmetro nº 167, de 13 de abril de 2021  e Portaria Inmetro nº 200, de 29 de abril de 2021.\n\nNormas aplicáveis: \nABNT NBR 14389:2010 - Segurança de carrinhos para crianças.\nABNT NBR 14400:2020 - Veículos rodoviários automotores — Dispositivos de retenção para crianças — Requisitos de segurança.\n\nModelo de certificação: 5\nValidade do certificado: 3 anos","FOR.10.14","Rev.02","2022-06-29","Amanda Siqueira ","2022-06-29","Realizado atualização de endereço conforme o CNPJ"]
[null,"CARRINHOS - MODELO 1b",{"$f":"10*12","v":120},null,"Em conformidade com requisitos da Portaria Inmetro nº 167, de 03 de abril de 2021 e à Norma ABNT NBR NM 14389:2010 e ABNT NBR NM 14400:2010, comprometendo-se à certificada a cumpri-las integralmente, pelo modelo 1b de certificação, e terá validade de 10 anos. ","Portarias aplicáveis:\nPortaria Inmetro nº 167, de 13 de abril de 2021  e Portaria Inmetro nº 200, de 29 de abril de 2021.\n\nNormas aplicáveis: \nABNT NBR 14389:2010 - Segurança de carrinhos para crianças.\nABNT NBR 14400:2020 - Veículos rodoviários automotores — Dispositivos de retenção para crianças — Requisitos de segurança\n\nModelo de certificação: 1b\nValidade do certificado: Indeterminado","FOR.10.15","Rev.02","2022-06-29","Amanda Siqueira ","2022-06-29","Realizado atualização de endereço conforme o CNPJ"]
[null,"CARRINHOS - MODELO 5",{"$f":"3*12","v":36},null,"Em conformidade com requisitos da Portaria Inmetro nº 167, de 03 de abril de 2021 e à Norma ABNT NBR NM 14389:2010 e ABNT NBR NM 14400:2020, comprometendo-se à certificada a cumpri-las integralmente, pelo modelo 5 de certificação, e terá validade de 3 anos.","Portarias aplicáveis:\nPortaria Inmetro nº 167, de 13 de abril de 2021  e Portaria Inmetro nº 200, de 29 de abril de 2021.\n\nNormas aplicáveis: \nABNT NBR 14389:2010 - Segurança de carrinhos para crianças.\nABNT NBR 14400:2020 - Veículos rodoviários automotores — Dispositivos de retenção para crianças — Requisitos de segurança.\n\nModelo de certificação: 5\nValidade do certificado: 3 anos","FOR.10.14","Rev.03","2022-08-29","Alexandre Colombo","2022-08-29","Revisão completa do conteúdo do registro"]
[null,"CARRINHOS - MODELO 1b",{"$f":"10*12","v":120},null,"Em conformidade com requisitos da Portaria Inmetro nº 167, de 03 de abril de 2021 e à Norma ABNT NBR NM 14389:2010 e ABNT NBR NM 14400:2010, comprometendo-se à certificada a cumpri-las integralmente, pelo modelo 1b de certificação, e terá validade de 10 anos. ","Portarias aplicáveis:\nPortaria Inmetro nº 167, de 13 de abril de 2021  e Portaria Inmetro nº 200, de 29 de abril de 2021.\n\nNormas aplicáveis: \nABNT NBR 14389:2010 - Segurança de carrinhos para crianças.\nABNT NBR 14400:2020 - Veículos rodoviários automotores — Dispositivos de retenção para crianças — Requisitos de segurança\n\nModelo de certificação: 1b\nValidade do certificado: Indeterminado","FOR.10.15","Rev.03","2022-08-29","Alexandre Colombo","2022-08-29","Revisão completa do conteúdo do registro"]

{"sheet":"Certificados Gerais","index":5,"n_rows":37,"n_cols":31,"rows_kept":37,"cut":false,"hidden":true,"merged":[[965,1,965,3],[965,4,965,8],[965,9,965,13],[965,14,965,18],[965,19,965,21],[965,22,965,24],[964,1,964,3],[964,4,964,8],[964,9,964,13],[964,14,964,18],[964,19,964,21],[968,1,968,3],[968,4,968,8],[968,9,968,13],[968,14,968,18],[968,19,968,21],[968,22,968,24],[967,1,967,3],[967,4,967,8],[967,9,967,13],[967,14,967,18],[967,19,967,21],[967,22,967,24],[966,1,966,3],[966,4,966,8],[966,9,966,13],[966,14,966,18],[966,19,966,21],[966,22,966,24],[964,22,964,24],[963,1,963,3],[963,4,963,8],[963,9,963,13],[963,14,963,18],[963,19,963,21],[963,22,963,24],[962,1,962,3],[962,4,962,8],[962,9,962,13],[962,14,962,18],[962,19,962,21],[962,22,962,24],[961,1,961,3],[961,4,961,8],[961,9,961,13],[961,14,961,18],[961,19,961,21],[961,22,961,24],[960,1,960,3],[960,4,960,8],[960,9,960,13],[960,14,960,18],[960,19,960,21],[960,22,960,24],[959,1,959,3],[959,4,959,8],[959,9,959,13],[959,14,959,18],[959,19,959,21],[959,22,959,24],[958,1,958,3],[958,4,958,8],[958,9,958,13],[958,14,958,18],[958,19,958,21],[958,22,958,24],[957,1,957,3],[957,4,957,8],[957,9,957,13],[957,14,957,18],[957,19,957,21],[957,22,957,24],[956,1,956,3],[956,4,956,8],[956,9,956,13],[956,14,956,18],[956,19,956,21],[956,22,956,24],[955,1,955,3],[955,4,955,8],[955,9,955,13],[955,14,955,18],[955,19,955,21],[955,22,955,24],[954,1,954,3],[954,4,954,8],[954,9,954,13],[954,14,954,18],[954,19,954,21],[954,22,954,24],[953,1,953,3],[953,4,953,8],[953,9,953,13],[953,14,953,18],[953,19,953,21],[953,22,953,24],[952,1,952,3],[952,4,952,8],[952,9,952,13],[952,14,952,18],[952,19,952,21],[952,22,952,24],[951,1,951,3],[951,4,951,8],[951,9,951,13],[951,14,951,18],[951,19,951,21],[951,22,951,24],[950,1,950,3],[950,4,950,8],[950,9,950,13],[950,14,950,18],[950,19,950,21],[950,22,950,24],[949,1,949,3],[949,4,949,8],[949,9,949,13],[949,14,949,18],[949,19,949,21],[949,22,949,24],[948,1,948,3],[948,4,948,8],[948,9,948,13],[948,14,948,18],[948,19,948,21],[948,22,948,24],[947,1,947,3],[947,4,947,8],[947,9,947,13],[947,14,947,18],[947,19,947,21],[947,22,947,24],[946,1,946,3],[946,4,946,8],[946,9,946,13],[946,14,946,18],[946,19,946,21],[946,22,946,24],[945,1,945,3],[945,4,945,8],[945,9,945,13],[945,14,945,18],[945,19,945,21],[945,22,945,24],[944,1,944,3],[944,4,944,8],[944,9,944,13],[944,14,944,18],[944,19,944,21],[944,22,944,24],[943,1,943,3],[943,4,943,8],[943,9,943,13],[943,14,943,18],[943,19,943,21],[943,22,943,24],[942,1,942,3],[942,4,942,8],[942,9,942,13],[942,14,942,18],[942,19,942,21],[942,22,942,24],[941,1,941,3],[941,4,941,8],[941,9,941,13],[941,14,941,18],[941,19,941,21],[941,22,941,24],[940,1,940,3],[940,4,940,8],[940,9,940,13],[940,14,940,18],[940,19,940,21],[940,22,940,24],[939,1,939,3],[939,4,939,8],[939,9,939,13],[939,14,939,18],[939,19,939,21],[939,22,939,24],[938,1,938,3],[938,4,938,8],[938,9,938,13],[938,14,938,18],[938,19,938,21],[938,22,938,24],[937,1,937,3],[937,4,937,8],[937,9,937,13],[937,14,937,18],[937,19,937,21],[937,22,937,24],[936,1,936,3],[936,4,936,8],[936,9,936,13],[936,14,936,18],[936,19,936,21],[936,22,936,24],[935,1,935,3],[935,4,935,8],[935,9,935,13],[935,14,935,18],[935,19,935,21],[935,22,935,24],[934,1,934,3],[934,4,934,8],[934,9,934,13],[934,14,934,18],[934,19,934,21],[934,22,934,24],[933,1,933,3],[933,4,933,8],[933,9,933,13],[933,14,933,18],[933,19,933,21],[933,22,933,24],[932,1,932,3],[932,4,932,8],[932,9,932,13],[932,14,932,18],[932,19,932,21],[932,22,932,24],[931,1,931,3],[931,4,931,8],[931,9,931,13],[931,14,931,18],[931,19,931,21],[931,22,931,24],[930,1,930,3],[930,4,930,8],[930,9,930,13],[930,14,930,18],[930,19,930,21],[930,22,930,24],[929,1,929,3],[929,4,929,8],[929,9,929,13],[929,14,929,18],[929,19,929,21],[929,22,929,24],[928,1,928,3],[928,4,928,8],[928,9,928,13],[928,14,928,18],[928,19,928,21],[928,22,928,24],[927,1,927,3],[927,4,927,8],[927,9,927,13],[927,14,927,18],[927,19,927,21],[927,22,927,24],[926,1,926,3],[926,4,926,8],[926,9,926,13],[926,14,926,18],[926,19,926,21],[926,22,926,24],[925,1,925,3],[925,4,925,8],[925,9,925,13],[925,14,925,18],[925,19,925,21],[925,22,925,24],[924,1,924,3],[924,4,924,8],[924,9,924,13],[924,14,924,18],[924,19,924,21],[924,22,924,24],[923,1,923,3],[923,4,923,8],[923,9,923,13],[923,14,923,18],[923,19,923,21],[923,22,923,24],[922,1,922,3],[922,4,922,8],[922,9,922,13],[922,14,922,18],[922,19,922,21],[922,22,922,24],[921,1,921,3],[921,4,921,8],[921,9,921,13],[921,14,921,18],[921,19,921,21],[921,22,921,24],[920,1,920,3],[920,4,920,8],[920,9,920,13],[920,14,920,18],[920,19,920,21],[920,22,920,24],[919,1,919,3],[919,4,919,8],[919,9,919,13],[919,14,919,18],[919,19,919,21],[919,22,919,24],[918,1,918,3],[918,4,918,8],[918,9,918,13],[918,14,918,18],[918,19,918,21],[918,22,918,24],[917,1,917,3],[917,4,917,8],[917,9,917,13],[917,14,917,18],[917,19,917,21],[917,22,917,24],[916,1,916,3],[916,4,916,8],[916,9,916,13],[916,14,916,18],[916,19,916,21],[916,22,916,24],[915,1,915,3],[915,4,915,8],[915,9,915,13],[915,14,915,18],[915,19,915,21],[915,22,915,24],[914,1,914,3],[914,4,914,8],[914,9,914,13],[914,14,914,18],[914,19,914,21],[914,22,914,24],[913,1,913,3],[913,4,913,8],[913,9,913,13],[913,14,913,18],[913,19,913,21],[913,22,913,24],[912,1,912,3],[912,4,912,8],[912,9,912,13],[912,14,912,18],[912,19,912,21],[912,22,912,24],[911,1,911,3],[911,4,911,8],[911,9,911,13],[911,14,911,18],[911,19,911,21],[911,22,911,24],[910,1,910,3],[910,4,910,8],[910,9,910,13],[910,14,910,18],[910,19,910,21],[910,22,910,24],[909,1,909,3],[909,4,909,8],[909,9,909,13],[909,14,909,18],[909,19,909,21],[909,22,909,24],[908,1,908,3],[908,4,908,8],[908,9,908,13],[908,14,908,18],[908,19,908,21],[908,22,908,24],[907,1,907,3],[907,4,907,8],[907,9,907,13],[907,14,907,18],[907,19,907,21],[907,22,907,24],[906,1,906,3],[906,4,906,8],[906,9,906,13],[906,14,906,18],[906,19,906,21],[906,22,906,24],[905,1,905,3],[905,4,905,8],[905,9,905,13],[905,14,905,18],[905,19,905,21],[905,22,905,24],[904,1,904,3],[904,4,904,8],[904,9,904,13],[904,14,904,18],[904,19,904,21],[904,22,904,24],[903,1,903,3],[903,4,903,8],[903,9,903,13],[903,14,903,18],[903,19,903,21],[903,22,903,24],[902,1,902,3],[902,4,902,8],[902,9,902,13],[902,14,902,18],[902,19,902,21],[902,22,902,24],[901,1,901,3],[901,4,901,8],[901,9,901,13],[901,14,901,18],[901,19,901,21],[901,22,901,24],[900,1,900,3],[900,4,900,8],[900,9,900,13],[900,14,900,18],[900,19,900,21],[900,22,900,24],[899,1,899,3],[899,4,899,8],[899,9,899,13],[899,14,899,18],[899,19,899,21],[899,22,899,24],[898,1,898,3],[898,4,898,8],[898,9,898,13],[898,14,898,18],[898,19,898,21],[898,22,898,24],[897,1,897,3],[897,4,897,8],[897,9,897,13],[897,14,897,18],[897,19,897,21],[897,22,897,24],[896,1,896,3],[896,4,896,8],[896,9,896,13],[896,14,896,18],[896,19,896,21],[896,22,896,24],[895,1,895,3],[895,4,895,8],[895,9,895,13],[895,14,895,18],[895,19,895,21],[895,22,895,24],[894,1,894,3],[894,4,894,8],[894,9,894,13],[894,14,894,18],[894,19,894,21],[894,22,894,24],[893,1,893,3],[893,4,893,8],[893,9,893,13],[893,14,893,18],[893,19,893,21],[893,22,893,24],[892,1,892,3],[892,4,892,8],[892,9,892,13],[892,14,892,18],[892,19,892,21],[892,22,892,24],[891,1,891,3],[891,4,891,8],[891,9,891,13],[891,14,891,18],[891,19,891,21],[891,22,891,24],[890,1,890,3],[890,4,890,8],[890,9,890,13],[890,14,890,18],[890,19,890,21],[890,22,890,24],[889,1,889,3],[889,4,889,8],[889,9,889,13],[889,14,889,18],[889,19,889,21],[889,22,889,24],[888,1,888,3],[888,4,888,8],[888,9,888,13],[888,14,888,18],[888,19,888,21],[888,22,888,24],[887,1,887,3],[887,4,887,8],[887,9,887,13],[887,14,887,18],[887,19,887,21],[887,22,887,24],[886,1,886,3],[886,4,886,8],[886,9,886,13],[886,14,886,18],[886,19,886,21],[886,22,886,24],[885,1,885,3],[885,4,885,8],[885,9,885,13],[885,14,885,18],[885,19,885,21],[885,22,885,24],[884,1,884,3],[884,4,884,8],[884,9,884,13],[884,14,884,18],[884,19,884,21],[884,22,884,24],[883,1,883,3],[883,4,883,8],[883,9,883,13],[883,14,883,18],[883,19,883,21],[883,22,883,24],[882,1,882,3],[882,4,882,8],[882,9,882,13],[882,14,882,18],[882,19,882,21],[882,22,882,24],[881,1,881,3],[881,4,881,8],[881,9,881,13],[881,14,881,18],[881,19,881,21],[881,22,881,24],[880,1,880,3],[880,4,880,8],[880,9,880,13],[880,14,880,18],[880,19,880,21],[880,22,880,24],[879,1,879,3],[879,4,879,8],[879,9,879,13],[879,14,879,18],[879,19,879,21],[879,22,879,24],[878,1,878,3],[878,4,878,8],[878,9,878,13],[878,14,878,18],[878,19,878,21],[878,22,878,24],[877,1,877,3],[877,4,877,8],[877,9,877,13],[877,14,877,18],[877,19,877,21],[877,22,877,24],[876,1,876,3],[876,4,876,8],[876,9,876,13],[876,14,876,18],[876,19,876,21],[876,22,876,24],[875,1,875,3],[875,4,875,8],[875,9,875,13],[875,14,875,18],[875,19,875,21],[875,22,875,24],[874,1,874,3],[874,4,874,8],[874,9,874,13],[874,14,874,18],[874,19,874,21],[874,22,874,24],[873,1,873,3],[873,4,873,8],[873,9,873,13],[873,14,873,18],[873,19,873,21],[873,22,873,24],[872,1,872,3],[872,4,872,8],[872,9,872,13],[872,14,872,18],[872,19,872,21],[872,22,872,24],[871,1,871,3],[871,4,871,8],[871,9,871,13],[871,14,871,18],[871,19,871,21],[871,22,871,24],[870,1,870,3],[870,4,870,8],[870,9,870,13],[870,14,870,18],[870,19,870,21],[870,22,870,24],[869,1,869,3],[869,4,869,8],[869,9,869,13],[869,14,869,18],[869,19,869,21],[869,22,869,24],[868,1,868,3],[868,4,868,8],[868,9,868,13],[868,14,868,18],[868,19,868,21],[868,22,868,24],[867,1,867,3],[867,4,867,8],[867,9,867,13],[867,14,867,18],[867,19,867,21],[867,22,867,24],[866,1,866,3],[866,4,866,8],[866,9,866,13],[866,14,866,18],[866,19,866,21],[866,22,866,24],[865,1,865,3],[865,4,865,8],[865,9,865,13],[865,14,865,18],[865,19,865,21],[865,22,865,24],[864,1,864,3],[864,4,864,8],[864,9,864,13],[864,14,864,18],[864,19,864,21],[864,22,864,24],[863,1,863,3],[863,4,863,8],[863,9,863,13],[863,14,863,18],[863,19,863,21],[863,22,863,24],[862,1,862,3],[862,4,862,8],[862,9,862,13],[862,14,862,18],[862,19,862,21],[862,22,862,24],[861,1,861,3],[861,4,861,8],[861,9,861,13],[861,14,861,18],[861,19,861,21],[861,22,861,24],[860,1,860,3],[860,4,860,8],[860,9,860,13],[860,14,860,18],[860,19,860,21],[860,22,860,24],[859,1,859,3],[859,4,859,8],[859,9,859,13],[859,14,859,18],[859,19,859,21],[859,22,859,24],[858,1,858,3],[858,4,858,8],[858,9,858,13],[858,14,858,18],[858,19,858,21],[858,22,858,24],[857,1,857,3],[857,4,857,8],[857,9,857,13],[857,14,857,18],[857,19,857,21],[857,22,857,24],[856,1,856,3],[856,4,856,8],[856,9,856,13],[856,14,856,18],[856,19,856,21],[856,22,856,24],[855,1,855,3],[855,4,855,8],[855,9,855,13],[855,14,855,18],[855,19,855,21],[855,22,855,24],[854,1,854,3],[854,4,854,8],[854,9,854,13],[854,14,854,18],[854,19,854,21],[854,22,854,24],[853,1,853,3],[853,4,853,8],[853,9,853,13],[853,14,853,18],[853,19,853,21],[853,22,853,24],[852,1,852,3],[852,4,852,8],[852,9,852,13],[852,14,852,18],[852,19,852,21],[852,22,852,24],[851,1,851,3],[851,4,851,8],[851,9,851,13],[851,14,851,18],[851,19,851,21],[851,22,851,24],[850,1,850,3],[850,4,850,8],[850,9,850,13],[850,14,850,18],[850,19,850,21],[850,22,850,24],[849,1,849,3],[849,4,849,8],[849,9,849,13],[849,14,849,18],[849,19,849,21],[849,22,849,24],[848,1,848,3],[848,4,848,8],[848,9,848,13],[848,14,848,18],[848,19,848,21],[848,22,848,24],[847,1,847,3],[847,4,847,8],[847,9,847,13],[847,14,847,18],[847,19,847,21],[847,22,847,24],[846,1,846,3],[846,4,846,8],[846,9,846,13],[846,14,846,18],[846,19,846,21],[846,22,846,24],[845,1,845,3],[845,4,845,8],[845,9,845,13],[845,14,845,18],[845,19,845,21],[845,22,845,24],[844,1,844,3],[844,4,844,8],[844,9,844,13],[844,14,844,18],[844,19,844,21],[844,22,844,24],[843,1,843,3],[843,4,843,8],[843,9,843,13],[843,14,843,18],[843,19,843,21],[843,22,843,24],[842,1,842,3],[842,4,842,8],[842,9,842,13],[842,14,842,18],[842,19,842,21],[842,22,842,24],[841,1,841,3],[841,4,841,8],[841,9,841,13],[841,14,841,18],[841,19,841,21],[841,22,841,24],[840,1,840,3],[840,4,840,8],[840,9,840,13],[840,14,840,18],[840,19,840,21],[840,22,840,24],[839,1,839,3],[839,4,839,8],[839,9,839,13],[839,14,839,18],[839,19,839,21],[839,22,839,24],[838,1,838,3],[838,4,838,8],[838,9,838,13],[838,14,838,18],[838,19,838,21],[838,22,838,24],[837,1,837,3],[837,4,837,8],[837,9,837,13],[837,14,837,18],[837,19,837,21],[837,22,837,24],[836,1,836,3],[836,4,836,8],[836,9,836,13],[836,14,836,18],[836,19,836,21],[836,22,836,24],[835,1,835,3],[835,4,835,8],[835,9,835,13],[835,14,835,18],[835,19,835,21],[835,22,835,24],[834,1,834,3],[834,4,834,8],[834,9,834,13],[834,14,834,18],[834,19,834,21],[834,22,834,24],[833,1,833,3],[833,4,833,8],[833,9,833,13],[833,14,833,18],[833,19,833,21],[833,22,833,24],[832,1,832,3],[832,4,832,8],[832,9,832,13],[832,14,832,18],[832,19,832,21],[832,22,832,24],[831,1,831,3],[831,4,831,8],[831,9,831,13],[831,14,831,18],[831,19,831,21],[831,22,831,24],[830,1,830,3],[830,4,830,8],[830,9,830,13],[830,14,830,18],[830,19,830,21],[830,22,830,24],[829,1,829,3],[829,4,829,8],[829,9,829,13],[829,14,829,18],[829,19,829,21],[829,22,829,24],[828,1,828,3],[828,4,828,8],[828,9,828,13],[828,14,828,18],[828,19,828,21],[828,22,828,24],[827,1,827,3],[827,4,827,8],[827,9,827,13],[827,14,827,18],[827,19,827,21],[827,22,827,24],[826,1,826,3],[826,4,826,8],[826,9,826,13],[826,14,826,18],[826,19,826,21],[826,22,826,24],[825,1,825,3],[825,4,825,8],[825,9,825,13],[825,14,825,18],[825,19,825,21],[825,22,825,24],[824,1,824,3],[824,4,824,8],[824,9,824,13],[824,14,824,18],[824,19,824,21],[824,22,824,24],[823,1,823,3],[823,4,823,8],[823,9,823,13],[823,14,823,18],[823,19,823,21],[823,22,823,24],[822,1,822,3],[822,4,822,8],[822,9,822,13],[822,14,822,18],[822,19,822,21],[822,22,822,24],[821,1,821,3],[821,4,821,8],[821,9,821,13],[821,14,821,18],[821,19,821,21],[821,22,821,24],[820,1,820,3],[820,4,820,8],[820,9,820,13],[820,14,820,18],[820,19,820,21],[820,22,820,24],[819,1,819,3],[819,4,819,8],[819,9,819,13],[819,14,819,18],[819,19,819,21],[819,22,819,24],[818,1,818,3],[818,4,818,8],[818,9,818,13],[818,14,818,18],[818,19,818,21],[818,22,818,24],[817,1,817,3],[817,4,817,8],[817,9,817,13],[817,14,817,18],[817,19,817,21],[817,22,817,24],[816,1,816,3],[816,4,816,8],[816,9,816,13],[816,14,816,18],[816,19,816,21],[816,22,816,24],[815,1,815,3],[815,4,815,8],[815,9,815,13],[815,14,815,18],[815,19,815,21],[815,22,815,24],[814,1,814,3],[814,4,814,8],[814,9,814,13],[814,14,814,18],[814,19,814,21],[814,22,814,24],[813,1,813,3],[813,4,813,8],[813,9,813,13],[813,14,813,18],[813,19,813,21],[813,22,813,24],[812,1,812,3],[812,4,812,8],[812,9,812,13],[812,14,812,18],[812,19,812,21],[812,22,812,24],[811,1,811,3],[811,4,811,8],[811,9,811,13],[811,14,811,18],[811,19,811,21],[811,22,811,24],[810,1,810,3],[810,4,810,8],[810,9,810,13],[810,14,810,18],[810,19,810,21],[810,22,810,24],[809,1,809,3],[809,4,809,8],[809,9,809,13],[809,14,809,18],[809,19,809,21],[809,22,809,24],[808,1,808,3],[808,4,808,8],[808,9,808,13],[808,14,808,18],[808,19,808,21],[808,22,808,24],[807,1,807,3],[807,4,807,8],[807,9,807,13],[807,14,807,18],[807,19,807,21],[807,22,807,24],[806,1,806,3],[806,4,806,8],[806,9,806,13],[806,14,806,18],[806,19,806,21],[806,22,806,24],[805,1,805,3],[805,4,805,8],[805,9,805,13],[805,14,805,18],[805,19,805,21],[805,22,805,24],[804,1,804,3],[804,4,804,8],[804,9,804,13],[804,14,804,18],[804,19,804,21],[804,22,804,24],[803,1,803,3],[803,4,803,8],[803,9,803,13],[803,14,803,18],[803,19,803,21],[803,22,803,24],[802,1,802,3],[802,4,802,8],[802,9,802,13],[802,14,802,18]],"merged_total":5650,"flags":["merged_cut"]}
[null,null,null,null,null,null,null,null,null,null,null,null,null,null,null,null,null,null,null,null,null,null,null,null,null,null,{"$f":"VLOOKUP(AB4,'Frases-prazos-revisões'!B8:L9,8)","v":"2022-08-29"}]
[null,"CERTIFICADO DE CONFORMIDADE",null,null,null,null,null,null,null,null,null,null,null,null,null,null,null,null,null,null,null,null,null,null,null,null,null,"Modelo de certificação",null,"Periodo de validade"]
[null,"CARRINHOS PARA CRIANÇAS",null,null,null,null,null,null,null,null,null,null,null,null,null,null,null,null,null,null,null,null,null,null,null,null,null,null,null,"Em meses","Em anos"]
[null,{"$f":"\"CERTIFICADO N°: \"&IF(IF(B2=\"CERTIFICADO DE CONFORMIDADE\",G21,AB6)=0,\"\",IF(B2=\"CERTIFICADO DE CONFORMIDADE\",G21,AB6))&AB9","v":"CERTIFICADO N°: Inserir IN"},null,null,null,null,null,null,null,null,null,null,null,null,null,null,null,null,null,null,null,null,null,null,null,null,{"$f":"VLOOKUP(AB4,'Frases-prazos-revisões'!B8:L9,6)&\" -\" &VLOOKUP(AB4,'Frases-prazos-revisões'!B8:L9,7)&\"   -\"","v":"FOR.10.14 -Rev.03   -"},"CARRINHOS - MODELO 5",null,36,{"$f":"IF(AB4=\"Selecionar opção\",\"\",(AD4/12))","v":3}]
[null,null,null,null,null,null,null,null,null,null,null,null,null,null,null,null,null,null,null,null,null,null,null,null,null,null,null,"INSIRA N° DO CERTIFICADO DE MANUTENÇÃ"]
[null,{"$f":"IF(AB4=\"Selecionar opção\",\"Selecionar modelo de certificação\",VLOOKUP(AB4,'Frases-prazos-revisões'!B6:L7,5,0))","v":"Portarias aplicáveis:\nPortaria Inmetro nº 167, de 13 de abril de 2021  e Portaria Inmetro nº 200, de 29 de abril de 2021.\n\nNormas aplicáveis: \nABNT NBR 14389:2010 - Segurança de carrinhos para crianças.\nABNT NBR 14400:2020 - Veículos rodoviários automotores — Dispositivos de retenção para crianças — Requisitos de segurança.\n\nModelo de certificação: 5\nValidade do certificado: 3 anos"}]
[null,{"$f":"IF(AB4=\"BRINQUEDOS - MODELO 4 - Portaria 321\",\"Concessão:\",IF(AB4=\"BRINQUEDOS - MODELO 5 - Portaria 321 - 4 mêses\",\"Concessão:\",IF(AB4=\"BRINQUEDOS - MODELO 5 - Portaria 321 - 8 mêses\",\"Concessão:\",IF(AB4=\"BRINQUEDOS - MODELO 5 - Portaria 321 - 12 mêses\",\"Concessão:\",IF(AB4=\"BRINQUEDOS - MODELO 1b - Portaria 321\",\"Concessão:\",IF(OR(AB4<>\"BRINQUEDOS - MODELO 4 - Portaria 321\",AB4<>\"BRINQUEDOS - MODELO 5 - Portaria 321 - 4 mêses\",AB4<>\"BRINQUEDOS - MODELO 5 - Portaria 321 - 8 mêses\",AB4<>\"BRINQUEDOS - MODELO 5 - Portaria 321 - 12 mêses\",AB4<>\"BRINQUEDOS - MODELO 1b - Portaria 321\"),\"Certificação concedida:\"))))))","v":"Certificação concedida:"},null,null,null,null,null,"INSERIR DATA"]
[null,"Validade da certificação:",null,null,null,null,null,{"$f":"IF(H7=\"Inserir data\",\"\",IF(H7=\"\",\"\",EDATE(H7,AD4)-1))","v":""},null,null,null,null,null,null,null,null,null,null,null,null,null,null,null,null,null,null,null,"NUMERO DA \"/\" DO N° DO CERTIFICADO"]
[null,{"$f":"IF(OR(B2=\"Selecionar opção\",B2=\"Certificado de conformidade\",AB4=\"Selecionar opção\"),\"\",IF(AND(B2=\"Certificado de manutenção\",AB4=\"carrinhos - modelo 1b\"),\"\",\"Certificado de manutenção válido de:\"))","v":""},null,null,null,null,null,null,null,null,{"$f":"IF(B9=\"\",\"\",\"Inserir data\")","v":""},null,null,null,null,null,null,null,null,{"$f":"IF(B9=\"\",\"\",\"até\")","v":""},{"$f":"IF(K9=\"Inserir data\",\"\",IF(K9=\"\",\"\",EDATE(K9,12)-1))","v":""}]
[]
[null,"Solicitante:",null,null,{"$f":"SOLICITAÇÃO!C9","v":"-"}]
[null,"CNPJ:",null,null,{"$f":"SOLICITAÇÃO!C11","v":"-"}]
[null,"Endereço:",null,null,{"$f":"SOLICITAÇÃO!C12&\" - \"&SOLICITAÇÃO!C13&\" - \"&SOLICITAÇÃO!C15&\" - \"&SOLICITAÇÃO!C16","v":"- - - - - - -"}]
[null,"CEP:",null,null,{"$f":"SOLICITAÇÃO!C14","v":"-"}]
[]
[null,"Fabricante:",null,null,{"$f":"SOLICITAÇÃO!C25","v":"-"}]
[null,"Endereço:",null,null,{"$f":"SOLICITAÇÃO!C28&\" - \"&SOLICITAÇÃO!C29&\" - \"&SOLICITAÇÃO!C31&\" - \"&SOLICITAÇÃO!C32","v":"- - - - - - -"}]
[null,"País:",null,null,{"$f":"IF(SOLICITAÇÃO!C38=0,\"-\",SOLICITAÇÃO!C38)","v":"-"}]
[]
[null,"Data da auditoria:",null,null,null,null,"Inserir",null,null,null,null,{"$f":"IF(AB4=\"CARRINHOS - Modelo 1b\",\"(Tratamento de reclamações)\",\"\")","v":""}]
[null,"Processo de decisão:",null,null,null,null,"Inserir IN",null,null,null,null,"Data:",null,null,"Inserir"]
[]
[null,"Laboratório:",null,null,"Selecionar laboratório de ensaios"]
[null,"Relatório de ensaio nº:",null,null,null,null,"Inserir"]
[null,"Data de emissão do relatório:",null,null,null,null,null,"Inserir"]
[null,{"$f":"IF(AB4=\"BERÇO - MODELO 1b\",\"Nº do edital:\",IF(AB4=\"CARRINHOS - MODELO 1b\",\"Nº do edital:\",IF(AB4=\"BRINQUEDOS - MODELO 1b - Portaria 563\",\"Nº do edital:\",IF(AB4=\"BRINQUEDOS - MODELO 1b - Portaria 321\",\"Nº do edital:\",IF(AB4=\"CADEIRA ALTA - MODELO 1b\",\"Nº do edital:\",IF(AB4=\"CPM - MODELO 1b\",\"Nº do edital:\",IF(AB4=\"PANELAS - MODELO 1b\",\"Nº do edital:\",IF(AB4=\"DRC - MODELO 1b\",\"Nº do edital:\",IF(AB4<>\"BERÇO - MODELO 1b\"\"CARRINHOS - MODELO 1b\"\"BRINQUEDOS - MODELO 1b - Portaria 563\"\"BRINQUEDOS - MODELO 1b - Portaria 321\"\"CADEIRA ALTA - MODELO 1b\"\"CPM - MODELO 1b\"\"DRC - MODELO 1b\"\"PANELAS - MODELO 1b\",\"\",IF(AB4=\"\",\"\"))))))))))","v":""},null,null,{"$f":"IF(B26=\"Nº do edital:\",\"Inserir\",\"\")","v":""},null,null,null,null,null,null,{"$f":"IF(AB4=\"BERÇO - MODELO 1b\",\"Licença de importação:\",IF(AB4=\"CARRINHOS - MODELO 1b\",\"Licença de importação:\",IF(AB4=\"BRINQUEDOS - MODELO 1b - Portaria 563\",\"Licença de importação:\",IF(AB4=\"BRINQUEDOS - MODELO 1b - Portaria 321\",\"Licença de importação:\",IF(AB4=\"CADEIRA ALTA - MODELO 1b\",\"Licença de importação:\",IF(AB4=\"CPM - MODELO 1b\",\"Licença de importação:\",IF(AB4=\"PANELAS - MODELO 1b\",\"Licença de importação:\",IF(AB4=\"DRC - MODELO 1b\",\"Licença de importação:\",IF(AB4<>\"BERÇO - MODELO 1b\"\"CARRINHOS - MODELO 1b\"\"BRINQUEDOS - MODELO 1b - Portaria 563\"\"BRINQUEDOS - MODELO 1b - Portaria 321\"\"CADEIRA ALTA - MODELO 1b\"\"CPM - MODELO 1b\"\"DRC - MODELO 1b\"\"PANELAS - MODELO 1b\",\"\",IF(AB4=\"\",\"\"))))))))))","v":""},null,null,null,null,null,null,null,{"$f":"IF(L26=\"Licença de importação:\",\"Inserir\",\"\")","v":""}]
[null,{"$f":"IF(AB4=\"BERÇO - MODELO 1b\",\"Identificação do lote:\",IF(AB4=\"CARRINHOS - MODELO 1b\",\"Identificação do lote:\",IF(AB4=\"BRINQUEDOS - MODELO 1b - Portaria 563\",\"Identificação do lote:\",IF(AB4=\"BRINQUEDOS - MODELO 1b - Portaria 321\",\"Identificação do lote:\",IF(AB4=\"CADEIRA ALTA - MODELO 1b\",\"Identificação do lote:\",IF(AB4=\"CPM - MODELO 1b\",\"Identificação do lote:\",IF(AB4=\"PANELAS - MODELO 1b\",\"Identificação do lote:\",IF(AB4=\"DRC - MODELO 1b\",\"Identificação do lote:\",IF(AB4<>\"BERÇO - MODELO 1b\"\"CARRINHOS - MODELO 1b\"\"BRINQUEDOS - MODELO 1b - Portaria 563\"\"BRINQUEDOS - MODELO 1b - Portaria 321\"\"CADEIRA ALTA - MODELO 1b\"\"CPM - MODELO 1b\"\"DRC - MODELO 1b\"\"PANELAS - MODELO 1b\",\"\",IF(AB4=\"\",\"\"))))))))))","v":""},null,null,null,null,{"$f":"IF(B27=\"Identificação do lote:\",\"Inserir\",\"\")","v":""}]
[null,{"$f":"IF(AB4=\"BERÇO - MODELO 1b\",\"Identificação do modelo:\",IF(AB4=\"CARRINHOS - MODELO 1b\",\"Identificação do modelo:\",IF(AB4=\"BRINQUEDOS - MODELO 1b - Portaria 563\",\"Identificação do modelo:\",IF(AB4=\"BRINQUEDOS - MODELO 1b - Portaria 321\",\"Identificação do modelo:\",IF(AB4=\"CADEIRA ALTA - MODELO 1b\",\"Identificação do modelo:\",IF(AB4=\"CPM - MODELO 1b\",\"Identificação do modelo:\",IF(AB4=\"PANELAS - MODELO 1b\",\"Identificação do modelo:\",IF(AB4=\"DRC - MODELO 1b\",\"Identificação do modelo:\",IF(AB4<>\"BERÇO - MODELO 1b\"\"CARRINHOS - MODELO 1b\"\"BRINQUEDOS - MODELO 1b - Portaria 563\"\"BRINQUEDOS - MODELO 1b - Portaria 321\"\"CADEIRA ALTA - MODELO 1b\"\"CPM - MODELO 1b\"\"DRC - MODELO 1b\"\"PANELAS - MODELO 1b\",\"\",IF(AB4=\"\",\"\"))))))))))","v":""},null,null,null,null,null,{"$f":"IF(B28=\"Identificação do modelo:\",\"Inserir\",\"\")","v":""}]
[null,null,null,null,null,null,null,null,null,null,null,null,null,null,null,null,null,null,"São Paulo,",null,"Inserir"]
[]
[]
[]
[null,"Gerente Técnica",null,null,null,null,null,null,null,null,null,null,null,null,null,"CEO"]
[]
[]
[null,"Nota 1: A validade deste Certificado está atrelada à realização das avaliações de manutenção e tratamento de possíveis não conformidades de acordo com as orientações do OCAN e somente acompanhado do anexo emitido por este organismo, estando sujeito às Portarias Inmetro. “Para verificação da condição atualizada de regularidade deste Certificado de Conformidade deve ser consultado o banco de dados de produtos e serviços certificados do Inmetro”.  "]
[null,"Nota 2: “Certificado de Conformidade válido somente acompanhado das páginas de 01 a 02”."]

{"sheet":"Anexo Carrinhos","index":6,"n_rows":48,"n_cols":7,"rows_kept":48,"cut":false,"hidden":true,"merged":[[20,2,23,2],[13,2,18,2],[7,1,7,5],[1,1,1,5],[0,1,0,5],[0,6,4,6],[5,6,12,6],[12,3,16,3],[12,1,47,1],[10,3,11,5],[23,4,23,5],[22,4,22,5],[21,4,21,5],[20,4,20,5],[19,4,19,5],[18,4,18,5],[17,4,17,5],[10,2,11,2],[10,1,11,1],[9,1,9,5]]}
[null,{"$f":"'Certificados Gerais'!B2","v":"CERTIFICADO DE CONFORMIDADE"},null,null,null,null,{"$f":"'Certificados Gerais'!AA1","v":"2022-08-29"}]
[null,{"$f":"'Certificados Gerais'!B3","v":"CARRINHOS PARA CRIANÇAS"}]
[]
[null,"CERTIFICADO:",{"$f":"IF('Certificados Gerais'!$AB$6=0,\"-\",'Certificados Gerais'!$AB$6)","v":"-"}]
[null,"EMISSÃO:",{"$f":"IF('Certificados Gerais'!$H$7=0,\"-\",'Certificados Gerais'!$H$7)","v":"INSERIR DATA"}]
[null,"VALIDADE:",{"$f":"IF('Certificados Gerais'!$H$7=0,\"-\",'Certificados Gerais'!$H$8)","v":""},null,null,null,{"$f":"'Certificados Gerais'!AA4","v":"FOR.10.14 -Rev.03   -"}]
[]
[null,{"$f":"IF(B1=\"CERTIFICADO DE MANUTENÇÃO\",\"CERTIFICADO DE MANUTENÇÃO VÁLIDO DE:\"&\"   \"&CONCATENATE(TEXT('Certificados Gerais'!K9,\"dd-mm-aaaa\"),\"  a  \",TEXT('Certificados Gerais'!U9,\"dd-mm-aaaa\")),\"\")","v":""}]
[]
[]
[null,"Marca","Designação\nComercial do Modelo","Descrição Técnica do Modelo"]
[]
[null,{"$f":"'MEMORIAL DESCRITIVO'!E5","v":"-"},"Modelo","Material:",{"$f":"'MEMORIAL DESCRITIVO'!C45","v":"Chassi: "},{"$f":"'MEMORIAL DESCRITIVO'!F45","v":"-"}]
[null,null,{"$f":"'MEMORIAL DESCRITIVO'!E4","v":"-"},null,{"$f":"'MEMORIAL DESCRITIVO'!C46","v":"Cesto para crianças (Moisés):"},{"$f":"'MEMORIAL DESCRITIVO'!F46","v":"-"}]
[null,null,null,null,{"$f":"'MEMORIAL DESCRITIVO'!C47","v":"Unidade de assento:"},{"$f":"'MEMORIAL DESCRITIVO'!F47","v":"-"}]
[null,null,null,null,{"$f":"'MEMORIAL DESCRITIVO'!C48","v":"Sistema de retenção:"},{"$f":"'MEMORIAL DESCRITIVO'!F48","v":"-"}]
[null,null,null,null,{"$f":"'MEMORIAL DESCRITIVO'!C49","v":"Dispositivos adicionais de retenção:"},{"$f":"'MEMORIAL DESCRITIVO'!F49","v":"-"}]
[null,null,null,"Dimensões:",{"$f":"'MEMORIAL DESCRITIVO'!F57","v":"-"}]
[null,null,null,"Mecanismo de travamento:",{"$f":"'MEMORIAL DESCRITIVO'!F60","v":"-"}]
[null,null,"Nome comercial","Sistema de montagem / ferragem:",{"$f":"'MEMORIAL DESCRITIVO'!F61","v":"-"}]
[null,null,{"$f":"'MEMORIAL DESCRITIVO'!E6","v":"-"},"Acessórios vendidos separadamente: "]
[null,null,null,"Acessórios contidos na embalagem: "]
[null,null,null,"Tipo: "]
[null,null,null,"Idade mínima / \nIdade máxima: ",{"$f":"'MEMORIAL DESCRITIVO'!F58&\" / \"&'MEMORIAL DESCRITIVO'!F59","v":"- / -"}]
[null,null,"Versão/Cor/Estampa","Código de Barras","Versão/Cor/Estampa","Código de Barras"]
[null,null,{"$f":"'Cor - Versões - Cód Barr'!C3","v":"-"},{"$f":"'Cor - Versões - Cód Barr'!D3","v":"-"},{"$f":"'Cor - Versões - Cód Barr'!C26","v":"-"},{"$f":"'Cor - Versões - Cód Barr'!D26","v":"-"}]
[null,null,{"$f":"'Cor - Versões - Cód Barr'!C4","v":"-"},{"$f":"'Cor - Versões - Cód Barr'!D4","v":"-"},{"$f":"'Cor - Versões - Cód Barr'!C27","v":"-"},{"$f":"'Cor - Versões - Cód Barr'!D27","v":"-"}]
[null,null,{"$f":"'Cor - Versões - Cód Barr'!C5","v":"-"},{"$f":"'Cor - Versões - Cód Barr'!D5","v":"-"},{"$f":"'Cor - Versões - Cód Barr'!C28","v":"-"},{"$f":"'Cor - Versões - Cód Barr'!D28","v":"-"}]
[null,null,{"$f":"'Cor - Versões - Cód Barr'!C6","v":"-"},{"$f":"'Cor - Versões - Cód Barr'!D6","v":"-"},{"$f":"'Cor - Versões - Cód Barr'!C29","v":"-"},{"$f":"'Cor - Versões - Cód Barr'!D29","v":"-"}]
[null,null,{"$f":"'Cor - Versões - Cód Barr'!C7","v":"-"},{"$f":"'Cor - Versões - Cód Barr'!D7","v":"-"},{"$f":"'Cor - Versões - Cód Barr'!C30","v":"-"},{"$f":"'Cor - Versões - Cód Barr'!D30","v":"-"}]
[null,null,{"$f":"'Cor - Versões - Cód Barr'!C8","v":"-"},{"$f":"'Cor - Versões - Cód Barr'!D8","v":"-"},{"$f":"'Cor - Versões - Cód Barr'!C31","v":"-"},{"$f":"'Cor - Versões - Cód Barr'!D31","v":"-"}]
[null,null,{"$f":"'Cor - Versões - Cód Barr'!C9","v":"-"},{"$f":"'Cor - Versões - Cód Barr'!D9","v":"-"},{"$f":"'Cor - Versões - Cód Barr'!C32","v":"-"},{"$f":"'Cor - Versões - Cód Barr'!D32","v":"-"}]
[null,null,{"$f":"'Cor - Versões - Cód Barr'!C10","v":"-"},{"$f":"'Cor - Versões - Cód Barr'!D10","v":"-"},{"$f":"'Cor - Versões - Cód Barr'!C33","v":"-"},{"$f":"'Cor - Versões - Cód Barr'!D33","v":"-"}]
[null,null,{"$f":"'Cor - Versões - Cód Barr'!C11","v":"-"},{"$f":"'Cor - Versões - Cód Barr'!D11","v":"-"},{"$f":"'Cor - Versões - Cód Barr'!C34","v":"-"},{"$f":"'Cor - Versões - Cód Barr'!D34","v":"-"}]
[null,null,{"$f":"'Cor - Versões - Cód Barr'!C12","v":"-"},{"$f":"'Cor - Versões - Cód Barr'!D12","v":"-"},{"$f":"'Cor - Versões - Cód Barr'!C35","v":"-"},{"$f":"'Cor - Versões - Cód Barr'!D35","v":"-"}]
[null,null,{"$f":"'Cor - Versões - Cód Barr'!C13","v":"-"},{"$f":"'Cor - Versões - Cód Barr'!D13","v":"-"},{"$f":"'Cor - Versões - Cód Barr'!C36","v":"-"},{"$f":"'Cor - Versões - Cód Barr'!D36","v":"-"}]
[null,null,{"$f":"'Cor - Versões - Cód Barr'!C14","v":"-"},{"$f":"'Cor - Versões - Cód Barr'!D14","v":"-"},{"$f":"'Cor - Versões - Cód Barr'!C37","v":"-"},{"$f":"'Cor - Versões - Cód Barr'!D37","v":"-"}]
[null,null,{"$f":"'Cor - Versões - Cód Barr'!C15","v":"-"},{"$f":"'Cor - Versões - Cód Barr'!D15","v":"-"},{"$f":"'Cor - Versões - Cód Barr'!C38","v":"-"},{"$f":"'Cor - Versões - Cód Barr'!D38","v":"-"}]
[null,null,{"$f":"'Cor - Versões - Cód Barr'!C16","v":"-"},{"$f":"'Cor - Versões - Cód Barr'!D16","v":"-"},{"$f":"'Cor - Versões - Cód Barr'!C39","v":"-"},{"$f":"'Cor - Versões - Cód Barr'!D39","v":"-"}]
[null,null,{"$f":"'Cor - Versões - Cód Barr'!C17","v":"-"},{"$f":"'Cor - Versões - Cód Barr'!D17","v":"-"},{"$f":"'Cor - Versões - Cód Barr'!C40","v":"-"},{"$f":"'Cor - Versões - Cód Barr'!D40","v":"-"}]
[null,null,{"$f":"'Cor - Versões - Cód Barr'!C18","v":"-"},{"$f":"'Cor - Versões - Cód Barr'!D18","v":"-"},{"$f":"'Cor - Versões - Cód Barr'!C41","v":"-"},{"$f":"'Cor - Versões - Cód Barr'!D41","v":"-"}]
[null,null,{"$f":"'Cor - Versões - Cód Barr'!C19","v":"-"},{"$f":"'Cor - Versões - Cód Barr'!D19","v":"-"},{"$f":"'Cor - Versões - Cód Barr'!C42","v":"-"},{"$f":"'Cor - Versões - Cód Barr'!D42","v":"-"}]
[null,null,{"$f":"'Cor - Versões - Cód Barr'!C20","v":"-"},{"$f":"'Cor - Versões - Cód Barr'!D20","v":"-"},{"$f":"'Cor - Versões - Cód Barr'!C43","v":"-"},{"$f":"'Cor - Versões - Cód Barr'!D43","v":"-"}]
[null,null,{"$f":"'Cor - Versões - Cód Barr'!C21","v":"-"},{"$f":"'Cor - Versões - Cód Barr'!D21","v":"-"},{"$f":"'Cor - Versões - Cód Barr'!C44","v":"-"},{"$f":"'Cor - Versões - Cód Barr'!D44","v":"-"}]
[null,null,{"$f":"'Cor - Versões - Cód Barr'!C22","v":"-"},{"$f":"'Cor - Versões - Cód Barr'!D22","v":"-"},{"$f":"'Cor - Versões - Cód Barr'!C45","v":"-"},{"$f":"'Cor - Versões - Cód Barr'!D45","v":"-"}]
[null,null,{"$f":"'Cor - Versões - Cód Barr'!C23","v":"-"},{"$f":"'Cor - Versões - Cód Barr'!D23","v":"-"},{"$f":"'Cor - Versões - Cód Barr'!C46","v":"-"},{"$f":"'Cor - Versões - Cód Barr'!D46","v":"-"}]
[null,null,{"$f":"'Cor - Versões - Cód Barr'!C24","v":"-"},{"$f":"'Cor - Versões - Cód Barr'!D24","v":"-"},{"$f":"'Cor - Versões - Cód Barr'!C47","v":"-"},{"$f":"'Cor - Versões - Cód Barr'!D47","v":"-"}]
[null,null,{"$f":"'Cor - Versões - Cód Barr'!C25","v":"-"},{"$f":"'Cor - Versões - Cód Barr'!D25","v":"-"}]

{"sheet":"Dados Solicitação","index":7,"n_rows":7,"n_cols":5,"rows_kept":7,"cut":false,"hidden":true,"merged":[]}
[null,"-","-","-","-"]
["-","NACIONAL","INICIAL","MODELO 5","BERÇO"]
["SIM","IMPORTADO","MANUTENÇÃO","MODELO 1b - LOTE","ANDADOR"]
["NÃO",null,"INCLUSÃO / REVISÃO",null,"MÓBILE"]
["N° DA LICENÇA P/ USO DE MARCAS:",null,"RECERTIFICAÇÃO",null,"JUMPER"]
[null,null,"TRANSFERÊNCIA",null,"BOUNCER"]
[null,null,null,null,"OUTROS"]

{"sheet":"Dados","index":8,"n_rows":26,"n_cols":15,"rows_kept":26,"cut":false,"hidden":true,"merged":[]}
["-",null,null,null,null,null,null,"-",null,"-"]
["Carrinho Tipo Berço",null,"-","-",null,"-","-","Não possui",null,"Liberação em duas ações consecutivas",null,"-",1,null,"-"]
["Carrinho Tipo Passeio",null,1,"Sem regulagem",null,"0 Meses","3 anos (15 Kg)","Fixo",null,"Liberação em duas ações simultâneas",null,"Sem acessórios contidos na embalagem ",1,null,"Manual (com auxílio de ferramentas)"]
["Carrinho Tipo Conversível ou Múltiplo",null,2,"Com regulagem",null,"6 Meses","Outro:","Removível",null,"Outro:",null,"Cesto porta-objetos",1,null,"Manual (sem auxílio de ferramentas)"]
["Carrinho combinado",null,3,"Outro:",null,"Outro:",null,null,null,null,null,"Capa de proteção frontal",1,null,"Encaixe (com auxílio de ferramentas)"]
[null,null,"Outro:",null,null,null,null,null,null,null,null,"Alça lateral para transporte",1,null,"Encaixe (sem auxílio de ferramentas)"]
[null,null,null,null,null,null,null,null,null,null,null,"Bandeja frontal e porta-bebidas",1,null,"Outro:"]
[null,null,null,null,null,null,null,null,null,null,null,"Capa de chuva",1]
[null,null,null,null,null,null,null,null,null,null,null,"Bolsa dos pais",1]
[null,null,null,null,null,null,null,null,null,null,null,"Bomba para encher pneus",1]
[null,null,null,null,null,null,null,null,null,null,null,"Dispositivo adicionais de retenção",2]
[null,null,null,null,null,null,null,null,null,null,null,"Cesto para crianças (MOISÉS):",2]
[null,null,null,null,null,null,null,null,null,null,null,"Outros:",2]
[]
[null,null,null,null,null,null,null,null,null,null,null,"-",1]
[null,null,null,null,null,null,null,null,null,null,null,"Sem acessórios vendidos separadamente",1]
[null,null,null,null,null,null,null,null,null,null,null,"Cesto porta-objetos",1]
[null,null,null,null,null,null,null,null,null,null,null,"Capa de proteção frontal",1]
[null,null,null,null,null,null,null,null,null,null,null,"Alça lateral para transporte",1]
[null,null,null,null,null,null,null,null,null,null,null,"Bandeja frontal e porta-bebidas",1]
[null,null,null,null,null,null,null,null,null,null,null,"Capa de chuva",1]
[null,null,null,null,null,null,null,null,null,null,null,"Bolsa dos pais",1]
[null,null,null,null,null,null,null,null,null,null,null,"Bomba para encher pneus",1]
[null,null,null,null,null,null,null,null,null,null,null,"Dispositivo adicionais de retenção",2]
[null,null,null,null,null,null,null,null,null,null,null,"Cesto para crianças (MOISÉS):",2]
[null,null,null,null,null,null,null,null,null,null,null,"Outros:",2]